{"text_format":"3","workbook":"xlsx","n_sheets":2,"sheets":["Meritev","Procenti"],"read":"whole","date_system":"1900"}

{"sheet":"Meritev","index":0,"n_rows":28,"n_cols":12,"rows_kept":28,"merged":[[0,2,0,3],[0,4,0,5],[0,6,0,7],[0,8,0,9],[0,10,0,11],[1,2,1,3],[1,4,1,5],[1,6,1,7],[1,8,1,9],[1,10,1,11],[2,2,2,3],[2,4,2,5],[2,6,2,7],[2,8,2,9],[2,10,2,11],[3,2,3,3],[3,4,3,5],[3,6,3,7],[3,8,3,9],[3,10,3,11],[4,2,4,3],[4,4,4,5],[4,6,4,7],[4,8,4,9],[4,10,4,11],[5,2,5,3],[5,4,5,5],[5,6,5,7],[5,8,5,9],[5,10,5,11],[6,2,6,3],[6,4,6,5],[6,6,6,7],[6,8,6,9],[6,10,6,11]]}
[null,"Podatki o vozilu: Znamka, model:"]
[null,"Pogon (bencin, dizel, hibrid, elekt.):"]
[null,"Menjalnik:"]
[null,"Število prevoženih kilometrov:"]
[null,"Letnik:"]
[null,"Slika:"]
[null,"BK meritve (X/33):","1. Vozilo",null,"2. Vozilo",null,"3. Vozilo",null,"4. Vozilo",null,"5. Vozilo"]
["Št.","Sestavni deli","BK","%","BK","%","BK","%","BK","%","BK","%"]
["1.","Vpliv na okolico",null,{"$f":"VLOOKUP(C9,Procenti!$Q$1:$R$169,2,FALSE)","v":{"v":0,"d":"0.0"}},null,{"$f":"VLOOKUP(E9,Procenti!$Q$1:$R$169,2,FALSE)","v":{"v":0,"d":"0.0"}},null,{"$f":"VLOOKUP(G9,Procenti!$Q$1:$R$169,2,FALSE)","v":{"v":0,"d":"0.0"}},null,{"$f":"VLOOKUP(I9,Procenti!$Q$1:$R$169,2,FALSE)","v":{"v":0,"d":"0.0"}},null,{"$f":"VLOOKUP(K9,Procenti!$Q$1:$R$169,2,FALSE)","v":{"v":0,"d":"0.0"}}]
["2.","Splošno stanje motorja",null,{"$f":"VLOOKUP(C10,Procenti!$Q$1:$R$169,2,FALSE)","v":{"v":0,"d":"0.0"}},null,{"$f":"VLOOKUP(E10,Procenti!$Q$1:$R$169,2,FALSE)","v":{"v":0,"d":"0.0"}},null,{"$f":"VLOOKUP(G10,Procenti!$Q$1:$R$169,2,FALSE)","v":{"v":0,"d":"0.0"}},null,{"$f":"VLOOKUP(I10,Procenti!$Q$1:$R$169,2,FALSE)","v":{"v":0,"d":"0.0"}},null,{"$f":"VLOOKUP(K10,Procenti!$Q$1:$R$169,2,FALSE)","v":{"v":0,"d":"0.0"}}]
["3.","Motor",null,{"$f":"VLOOKUP(C11,Procenti!$Q$1:$R$169,2,FALSE)","v":{"v":0,"d":"0.0"}},null,{"$f":"VLOOKUP(E11,Procenti!$Q$1:$R$169,2,FALSE)","v":{"v":0,"d":"0.0"}},null,{"$f":"VLOOKUP(G11,Procenti!$Q$1:$R$169,2,FALSE)","v":{"v":0,"d":"0.0"}},null,{"$f":"VLOOKUP(I11,Procenti!$Q$1:$R$169,2,FALSE)","v":{"v":0,"d":"0.0"}},null,{"$f":"VLOOKUP(K11,Procenti!$Q$1:$R$169,2,FALSE)","v":{"v":0,"d":"0.0"}}]
["4.","Ventili motorja (kopičenje ogljika)",null,{"$f":"VLOOKUP(C12,Procenti!$Q$1:$R$169,2,FALSE)","v":{"v":0,"d":"0.0"}},null,{"$f":"VLOOKUP(E12,Procenti!$Q$1:$R$169,2,FALSE)","v":{"v":0,"d":"0.0"}},null,{"$f":"VLOOKUP(G12,Procenti!$Q$1:$R$169,2,FALSE)","v":{"v":0,"d":"0.0"}},null,{"$f":"VLOOKUP(I12,Procenti!$Q$1:$R$169,2,FALSE)","v":{"v":0,"d":"0.0"}},null,{"$f":"VLOOKUP(K12,Procenti!$Q$1:$R$169,2,FALSE)","v":{"v":0,"d":"0.0"}}]
["5.","Zavore",null,{"$f":"VLOOKUP(C13,Procenti!$Q$1:$R$169,2,FALSE)","v":{"v":0,"d":"0.0"}},null,{"$f":"VLOOKUP(E13,Procenti!$Q$1:$R$169,2,FALSE)","v":{"v":0,"d":"0.0"}},null,{"$f":"VLOOKUP(G13,Procenti!$Q$1:$R$169,2,FALSE)","v":{"v":0,"d":"0.0"}},null,{"$f":"VLOOKUP(I13,Procenti!$Q$1:$R$169,2,FALSE)","v":{"v":0,"d":"0.0"}},null,{"$f":"VLOOKUP(K13,Procenti!$Q$1:$R$169,2,FALSE)","v":{"v":0,"d":"0.0"}}]
["6.","Krmilna veriga (delovanje kompleta)",null,{"$f":"VLOOKUP(C14,Procenti!$Q$1:$R$169,2,FALSE)","v":{"v":0,"d":"0.0"}},null,{"$f":"VLOOKUP(E14,Procenti!$Q$1:$R$169,2,FALSE)","v":{"v":0,"d":"0.0"}},null,{"$f":"VLOOKUP(G14,Procenti!$Q$1:$R$169,2,FALSE)","v":{"v":0,"d":"0.0"}},null,{"$f":"VLOOKUP(I14,Procenti!$Q$1:$R$169,2,FALSE)","v":{"v":0,"d":"0.0"}},null,{"$f":"VLOOKUP(K14,Procenti!$Q$1:$R$169,2,FALSE)","v":{"v":0,"d":"0.0"}}]
["7.","Turbina",null,{"$f":"VLOOKUP(C15,Procenti!$Q$1:$R$169,2,FALSE)","v":{"v":0,"d":"0.0"}},null,{"$f":"VLOOKUP(E15,Procenti!$Q$1:$R$169,2,FALSE)","v":{"v":0,"d":"0.0"}},null,{"$f":"VLOOKUP(G15,Procenti!$Q$1:$R$169,2,FALSE)","v":{"v":0,"d":"0.0"}},null,{"$f":"VLOOKUP(I15,Procenti!$Q$1:$R$169,2,FALSE)","v":{"v":0,"d":"0.0"}},null,{"$f":"VLOOKUP(K15,Procenti!$Q$1:$R$169,2,FALSE)","v":{"v":0,"d":"0.0"}}]
["8.","Elektronika",null,{"$f":"VLOOKUP(C16,Procenti!$Q$1:$R$169,2,FALSE)","v":{"v":0,"d":"0.0"}},null,{"$f":"VLOOKUP(E16,Procenti!$Q$1:$R$169,2,FALSE)","v":{"v":0,"d":"0.0"}},null,{"$f":"VLOOKUP(G16,Procenti!$Q$1:$R$169,2,FALSE)","v":{"v":0,"d":"0.0"}},null,{"$f":"VLOOKUP(I16,Procenti!$Q$1:$R$169,2,FALSE)","v":{"v":0,"d":"0.0"}},null,{"$f":"VLOOKUP(K16,Procenti!$Q$1:$R$169,2,FALSE)","v":{"v":0,"d":"0.0"}}]
["9.","Visokotlačna črpalka",null,{"$f":"VLOOKUP(C17,Procenti!$Q$1:$R$169,2,FALSE)","v":{"v":0,"d":"0.0"}},null,{"$f":"VLOOKUP(E17,Procenti!$Q$1:$R$169,2,FALSE)","v":{"v":0,"d":"0.0"}},null,{"$f":"VLOOKUP(G17,Procenti!$Q$1:$R$169,2,FALSE)","v":{"v":0,"d":"0.0"}},null,{"$f":"VLOOKUP(I17,Procenti!$Q$1:$R$169,2,FALSE)","v":{"v":0,"d":"0.0"}},null,{"$f":"VLOOKUP(K17,Procenti!$Q$1:$R$169,2,FALSE)","v":{"v":0,"d":"0.0"}}]
["10.","Hladilnik klime",null,{"$f":"VLOOKUP(C18,Procenti!$Q$1:$R$169,2,FALSE)","v":{"v":0,"d":"0.0"}},null,{"$f":"VLOOKUP(E18,Procenti!$Q$1:$R$169,2,FALSE)","v":{"v":0,"d":"0.0"}},null,{"$f":"VLOOKUP(G18,Procenti!$Q$1:$R$169,2,FALSE)","v":{"v":0,"d":"0.0"}},null,{"$f":"VLOOKUP(I18,Procenti!$Q$1:$R$169,2,FALSE)","v":{"v":0,"d":"0.0"}},null,{"$f":"VLOOKUP(K18,Procenti!$Q$1:$R$169,2,FALSE)","v":{"v":0,"d":"0.0"}}]
["11.","Potencialna poraba motornega olja",null,{"$f":"VLOOKUP(C19,Procenti!$Q$1:$R$169,2,FALSE)","v":{"v":0,"d":"0.0"}},null,{"$f":"VLOOKUP(E19,Procenti!$Q$1:$R$169,2,FALSE)","v":{"v":0,"d":"0.0"}},null,{"$f":"VLOOKUP(G19,Procenti!$Q$1:$R$169,2,FALSE)","v":{"v":0,"d":"0.0"}},null,{"$f":"VLOOKUP(I19,Procenti!$Q$1:$R$169,2,FALSE)","v":{"v":0,"d":"0.0"}},null,{"$f":"VLOOKUP(K19,Procenti!$Q$1:$R$169,2,FALSE)","v":{"v":0,"d":"0.0"}}]
["12.","Sklopka",null,{"$f":"VLOOKUP(C20,Procenti!$Q$1:$R$169,2,FALSE)","v":{"v":0,"d":"0.0"}},null,{"$f":"VLOOKUP(E20,Procenti!$Q$1:$R$169,2,FALSE)","v":{"v":0,"d":"0.0"}},null,{"$f":"VLOOKUP(G20,Procenti!$Q$1:$R$169,2,FALSE)","v":{"v":0,"d":"0.0"}},null,{"$f":"VLOOKUP(I20,Procenti!$Q$1:$R$169,2,FALSE)","v":{"v":0,"d":"0.0"}},null,{"$f":"VLOOKUP(K20,Procenti!$Q$1:$R$169,2,FALSE)","v":{"v":0,"d":"0.0"}}]
["13.","Karoserija",null,{"$f":"VLOOKUP(C21,Procenti!$Q$1:$R$169,2,FALSE)","v":{"v":0,"d":"0.0"}},null,{"$f":"VLOOKUP(E21,Procenti!$Q$1:$R$169,2,FALSE)","v":{"v":0,"d":"0.0"}},null,{"$f":"VLOOKUP(G21,Procenti!$Q$1:$R$169,2,FALSE)","v":{"v":0,"d":"0.0"}},null,{"$f":"VLOOKUP(I21,Procenti!$Q$1:$R$169,2,FALSE)","v":{"v":0,"d":"0.0"}},null,{"$f":"VLOOKUP(K21,Procenti!$Q$1:$R$169,2,FALSE)","v":{"v":0,"d":"0.0"}}]
["14.","Gume",null,{"$f":"VLOOKUP(C22,Procenti!$Q$1:$R$169,2,FALSE)","v":{"v":0,"d":"0.0"}},null,{"$f":"VLOOKUP(E22,Procenti!$Q$1:$R$169,2,FALSE)","v":{"v":0,"d":"0.0"}},null,{"$f":"VLOOKUP(G22,Procenti!$Q$1:$R$169,2,FALSE)","v":{"v":0,"d":"0.0"}},null,{"$f":"VLOOKUP(I22,Procenti!$Q$1:$R$169,2,FALSE)","v":{"v":0,"d":"0.0"}},null,{"$f":"VLOOKUP(K22,Procenti!$Q$1:$R$169,2,FALSE)","v":{"v":0,"d":"0.0"}}]
["15.","Baterija* (hibridno, električno vozilo)",null,{"$f":"VLOOKUP(C23,Procenti!$Q$1:$R$169,2,FALSE)","v":{"v":0,"d":"0.0"}},null,{"$f":"VLOOKUP(E23,Procenti!$Q$1:$R$169,2,FALSE)","v":{"v":0,"d":"0.0"}},null,{"$f":"VLOOKUP(G23,Procenti!$Q$1:$R$169,2,FALSE)","v":{"v":0,"d":"0.0"}},null,{"$f":"VLOOKUP(I23,Procenti!$Q$1:$R$169,2,FALSE)","v":{"v":0,"d":"0.0"}},null,{"$f":"VLOOKUP(K23,Procenti!$Q$1:$R$169,2,FALSE)","v":{"v":0,"d":"0.0"}}]
["16.","Ustrezno za nakup",null,{"$f":"VLOOKUP(C24,Procenti!$Q$1:$R$169,2,FALSE)","v":{"v":0,"d":"0.0"}},null,{"$f":"VLOOKUP(E24,Procenti!$Q$1:$R$169,2,FALSE)","v":{"v":0,"d":"0.0"}},null,{"$f":"VLOOKUP(G24,Procenti!$Q$1:$R$169,2,FALSE)","v":{"v":0,"d":"0.0"}},null,{"$f":"VLOOKUP(I24,Procenti!$Q$1:$R$169,2,FALSE)","v":{"v":0,"d":"0.0"}},null,{"$f":"VLOOKUP(K24,Procenti!$Q$1:$R$169,2,FALSE)","v":{"v":0,"d":"0.0"}}]
["17.",null,null,{"$f":"VLOOKUP(C25,Procenti!$Q$1:$R$169,2,FALSE)","v":{"v":0,"d":"0.0"}},null,{"$f":"VLOOKUP(E25,Procenti!$Q$1:$R$169,2,FALSE)","v":{"v":0,"d":"0.0"}},null,{"$f":"VLOOKUP(G25,Procenti!$Q$1:$R$169,2,FALSE)","v":{"v":0,"d":"0.0"}},null,{"$f":"VLOOKUP(I25,Procenti!$Q$1:$R$169,2,FALSE)","v":{"v":0,"d":"0.0"}},null,{"$f":"VLOOKUP(K25,Procenti!$Q$1:$R$169,2,FALSE)","v":{"v":0,"d":"0.0"}}]
["18.",null,null,{"$f":"VLOOKUP(C26,Procenti!$Q$1:$R$169,2,FALSE)","v":{"v":0,"d":"0.0"}},null,{"$f":"VLOOKUP(E26,Procenti!$Q$1:$R$169,2,FALSE)","v":{"v":0,"d":"0.0"}},null,{"$f":"VLOOKUP(G26,Procenti!$Q$1:$R$169,2,FALSE)","v":{"v":0,"d":"0.0"}},null,{"$f":"VLOOKUP(I26,Procenti!$Q$1:$R$169,2,FALSE)","v":{"v":0,"d":"0.0"}},null,{"$f":"VLOOKUP(K26,Procenti!$Q$1:$R$169,2,FALSE)","v":{"v":0,"d":"0.0"}}]
["19.",null,null,{"$f":"VLOOKUP(C27,Procenti!$Q$1:$R$169,2,FALSE)","v":{"v":0,"d":"0.0"}},null,{"$f":"VLOOKUP(E27,Procenti!$Q$1:$R$169,2,FALSE)","v":{"v":0,"d":"0.0"}},null,{"$f":"VLOOKUP(G27,Procenti!$Q$1:$R$169,2,FALSE)","v":{"v":0,"d":"0.0"}},null,{"$f":"VLOOKUP(I27,Procenti!$Q$1:$R$169,2,FALSE)","v":{"v":0,"d":"0.0"}},null,{"$f":"VLOOKUP(K27,Procenti!$Q$1:$R$169,2,FALSE)","v":{"v":0,"d":"0.0"}}]
["20.",null,null,{"$f":"VLOOKUP(C28,Procenti!$Q$1:$R$169,2,FALSE)","v":{"v":0,"d":"0.0"}},null,{"$f":"VLOOKUP(E28,Procenti!$Q$1:$R$169,2,FALSE)","v":{"v":0,"d":"0.0"}},null,{"$f":"VLOOKUP(G28,Procenti!$Q$1:$R$169,2,FALSE)","v":{"v":0,"d":"0.0"}},null,{"$f":"VLOOKUP(I28,Procenti!$Q$1:$R$169,2,FALSE)","v":{"v":0,"d":"0.0"}},null,{"$f":"VLOOKUP(K28,Procenti!$Q$1:$R$169,2,FALSE)","v":{"v":0,"d":"0.0"}}]

{"sheet":"Procenti","index":1,"n_rows":4872,"n_cols":23,"rows_kept":4872}
[{"$nulls":4},0,{"$f":"(E1/33)*100","v":0},0,{"$f":"(0/28)*100","v":0},{"$nulls":8},33,100,0,"MP4A0",{"$f":"(S1/4872)*100","v":{"v":0,"d":"0.000"}},"MP1A0",{"$f":"(S1/167)*100","v":{"v":0,"d":"0.000"}}]
["A0",{"$f":"(E1/168)*100","v":{"v":0,"d":"0.0"}},"A0",{"$f":"(E1/24)*100","v":0},1,{"v":3.0303030303030303,"d":"3"},1,{"$f":"(1/28)*100","v":{"v":3.571428571428571,"d":"4"}},35,{"$f":"(0/7)*100","v":0},36,{"$f":"(0/6)*100","v":{"v":0,"d":"0.0"}},8,{"$f":"(M2/8)*100","v":100},11,{"$f":"(O2/11)*100","v":100},32,{"v":96.96969696969697,"d":"97"},1,"MP4A001",{"v":0.020525451559934318,"d":"0.021"},"MP1A001",{"v":0.5988023952095809,"d":"0.599"}]
["A001",{"v":0.5952380952380952,"d":"0.6"},"A001",{"v":4.166666666666666,"d":"4"},2,{"v":6.0606060606060606,"d":"6"},2,{"$f":"(2/28)*100","v":{"v":7.142857142857142,"d":"7"}},36,{"$f":"(1/7)*100","v":{"v":14.285714285714285,"d":"14"}},37,{"$f":"(1/6)*100","v":{"v":16.666666666666664,"d":"16.7"}},7,{"v":87.5,"d":"88"},10,{"v":90.9090909090909,"d":"91"},31,{"v":93.93939393939394,"d":"94"},2,"MP4A002",{"v":0.041050903119868636,"d":"0.041"},"MP1A002",{"v":1.1976047904191618,"d":"1.198"}]
["A002",{"v":1.1904761904761905,"d":"1.2"},"A002",{"v":8.333333333333332,"d":"8"},3,{"v":9.090909090909092,"d":"9"},3,{"$f":"(3/28)*100","v":{"v":10.714285714285714,"d":"11"}},37,{"$f":"(2/7)*100","v":{"v":28.57142857142857,"d":"29"}},38,{"$f":"(2/6)*100","v":{"v":33.33333333333333,"d":"33.3"}},6,75,9,{"v":81.81818181818183,"d":"82"},30,{"v":90.9090909090909,"d":"91"},3,"MP4A003",{"v":0.06157635467980296,"d":"0.062"},"MP1A003",{"v":1.7964071856287425,"d":"1.796"}]
["A003",{"v":1.7857142857142856,"d":"1.8"},"A003",{"v":12.5,"d":"13"},4,{"v":12.121212121212121,"d":"12"},4,{"$f":"(4/28)*100","v":{"v":14.285714285714285,"d":"14"}},38,{"$f":"(3/7)*100","v":{"v":42.857142857142854,"d":"43"}},39,{"$f":"(3/6)*100","v":{"v":50,"d":"50.0"}},5,{"v":62.5,"d":"63"},8,{"v":72.72727272727273,"d":"73"},29,{"v":87.87878787878788,"d":"88"},4,"MP4A006",{"v":0.08210180623973727,"d":"0.082"},"MP1A006",{"v":2.3952095808383236,"d":"2.395"}]
["A006",{"v":2.380952380952381,"d":"2.4"},"A006",{"v":16.666666666666664,"d":"17"},5,{"v":15.151515151515152,"d":"15"},5,{"$f":"(5/28)*100","v":{"v":17.857142857142858,"d":"18"}},39,{"$f":"(4/7)*100","v":{"v":57.14285714285714,"d":"57"}},40,{"$f":"(4/6)*100","v":{"v":66.66666666666666,"d":"66.7"}},4,50,7,{"v":63.63636363636363,"d":"64"},28,{"v":84.84848484848484,"d":"85"},5,"MP4A009",{"v":0.10262725779967159,"d":"0.103"},"MP1A009",{"v":2.9940119760479043,"d":"2.994"}]
["A009",{"v":2.976190476190476,"d":"3.0"},"A009",{"v":20.833333333333336,"d":"21"},6,{"v":18.181818181818183,"d":"18"},6,{"$f":"(6/28)*100","v":{"v":21.428571428571427,"d":"21"}},40,{"$f":"(5/7)*100","v":{"v":71.42857142857143,"d":"71"}},41,{"$f":"(5/6)*100","v":{"v":83.33333333333334,"d":"83.3"}},3,{"v":37.5,"d":"38"},6,{"v":54.54545454545454,"d":"55"},27,{"v":81.81818181818183,"d":"82"},6,"MP4A012",{"v":0.12315270935960591,"d":"0.123"},"MP1A012",{"v":3.592814371257485,"d":"3.593"}]
["A012",{"v":3.571428571428571,"d":"3.6"},"A012",25,7,{"v":21.21212121212121,"d":"21"},7,{"$f":"(7/28)*100","v":25},41,{"$f":"(6/7)*100","v":{"v":85.71428571428571,"d":"86"}},42,{"$f":"(6/6)*100","v":{"v":100,"d":"100.0"}},2,25,5,{"v":45.45454545454545,"d":"45"},26,{"v":78.78787878787878,"d":"79"},7,"MP4A024",{"v":0.14367816091954022,"d":"0.144"},"MP1A024",{"v":4.191616766467066,"d":"4.192"}]
["A024",{"v":4.166666666666666,"d":"4.2"},"A024",{"v":29.166666666666668,"d":"29"},8,{"v":24.242424242424242,"d":"24"},8,{"$f":"(8/28)*100","v":{"v":28.57142857142857,"d":"29"}},42,{"$f":"(7/7)*100","v":100},"A024",{"v":0,"d":"0.0"},1,{"v":12.5,"d":"13"},4,{"v":36.36363636363637,"d":"36"},25,{"v":75.75757575757575,"d":"76"},8,"MP4A036",{"v":0.16420361247947454,"d":"0.164"},"MP1A036",{"v":4.790419161676647,"d":"4.790"}]
["A036",{"v":4.761904761904762,"d":"4.8"},"A036",{"v":33.33333333333333,"d":"33"},9,{"v":27.27272727272727,"d":"27"},9,{"$f":"(9/28)*100","v":{"v":32.142857142857146,"d":"32"}},null,null,"A036",{"v":0.625,"d":"0.6"},-1,{"$f":"(M10/12)*100","v":{"v":-8.333333333333332,"d":"-8"}},3,{"v":27.27272727272727,"d":"27"},24,{"v":72.72727272727273,"d":"73"},9,"MP4A048",{"v":0.18472906403940886,"d":"0.185"},"MP1A048",{"v":5.389221556886228,"d":"5.389"}]
["A048",{"v":5.357142857142857,"d":"5.4"},"A048",{"v":37.5,"d":"38"},10,{"v":30.303030303030305,"d":"30"},10,{"$f":"(10/28)*100","v":{"v":35.714285714285715,"d":"36"}},null,null,"A048",{"v":1.25,"d":"1.3"},-2,{"v":-16.666666666666664,"d":"-17"},2,{"v":18.181818181818183,"d":"18"},23,{"v":69.6969696969697,"d":"70"},10,"MP4A096",{"v":0.20525451559934318,"d":"0.205"},"MP1A096",{"v":5.9880239520958085,"d":"5.988"}]
["A096",{"v":5.952380952380952,"d":"6.0"},"A096",{"v":41.66666666666667,"d":"42"},11,{"v":33.33333333333333,"d":"33"},11,{"$f":"(11/28)*100","v":{"v":39.285714285714285,"d":"39"}},null,null,"A096",{"v":1.875,"d":"1.9"},-3,-25,1,{"v":9.090909090909092,"d":"9"},22,{"v":66.66666666666666,"d":"67"},11,"MP4A144",{"v":0.22577996715927748,"d":"0.226"},"MP1A144",{"v":6.58682634730539,"d":"6.587"}]
["A144",{"v":6.547619047619048,"d":"6.5"},"A144",{"v":45.83333333333333,"d":"46"},12,{"v":36.36363636363637,"d":"36"},12,{"$f":"(12/28)*100","v":{"v":42.857142857142854,"d":"43"}},null,null,"A144",2.5,-4,{"v":-33.33333333333333,"d":"-33"},33,-9,21,{"v":63.63636363636363,"d":"64"},12,"MP4A192",{"v":0.24630541871921183,"d":"0.246"},"MP1A192",{"v":7.18562874251497,"d":"7.186"}]
["A192",{"v":7.142857142857142,"d":"7.1"},"A192",50,13,{"v":39.39393939393939,"d":"39"},13,{"$f":"(13/28)*100","v":{"v":46.42857142857143,"d":"46"}},null,null,"A192",{"v":3.125,"d":"3.1"},-5,{"v":-41.66666666666667,"d":"-42"},32,-18,20,{"v":60.60606060606061,"d":"61"},13,"MP4A384",{"v":0.26683087027914615,"d":"0.267"},"MP1A384",{"v":7.784431137724551,"d":"7.784"}]
["A384",{"v":7.738095238095238,"d":"7.7"},"A384",{"v":54.166666666666664,"d":"54"},14,{"v":42.42424242424242,"d":"42"},14,{"$f":"(14/28)*100","v":50},null,null,"A384",{"v":3.75,"d":"3.8"},-6,-50,31,-27,19,{"v":57.57575757575758,"d":"58"},14,"MP4B0",{"v":0.28735632183908044,"d":"0.287"},"MP1B0",{"v":8.383233532934131,"d":"8.383"}]
["B0",{"v":8.333333333333332,"d":"8.3"},"B0",{"v":58.333333333333336,"d":"58"},15,{"v":45.45454545454545,"d":"45"},15,{"$f":"(15/28)*100","v":{"v":53.57142857142857,"d":"54"}},null,null,"B0",{"v":4.375,"d":"4.4"},-7,{"v":-58.333333333333336,"d":"-58"},30,-36,18,{"v":54.54545454545454,"d":"55"},15,"MP4B001",{"v":0.3078817733990148,"d":"0.308"},"MP1B001",{"v":8.982035928143713,"d":"8.982"}]
["B001",{"v":8.928571428571429,"d":"8.9"},"B001",{"v":62.5,"d":"63"},16,{"v":48.484848484848484,"d":"48"},16,{"$f":"(16/28)*100","v":{"v":57.14285714285714,"d":"57"}},null,null,"B001",{"v":5,"d":"5.0"},-8,{"v":-66.66666666666666,"d":"-67"},29,-45,17,{"v":51.515151515151516,"d":"52"},16,"MP4B002",{"v":0.3284072249589491,"d":"0.328"},"MP1B002",{"v":9.580838323353294,"d":"9.581"}]
["B002",{"v":9.523809523809524,"d":"9.5"},"B002",{"v":66.66666666666666,"d":"67"},17,{"v":51.515151515151516,"d":"52"},17,{"$f":"(17/28)*100","v":{"v":60.71428571428571,"d":"61"}},null,null,"B002",{"v":5.625,"d":"5.6"},-9,-75,28,-55,16,{"v":48.484848484848484,"d":"48"},17,"MP4B003",{"v":0.34893267651888343,"d":"0.349"},"MP1B003",{"v":10.179640718562874,"d":"10.180"}]
["B003",{"v":10.119047619047619,"d":"10.1"},"B003",{"v":70.83333333333334,"d":"71"},18,{"v":54.54545454545454,"d":"55"},18,{"$f":"(18/28)*100","v":{"v":64.28571428571429,"d":"64"}},null,null,"B003",{"v":6.25,"d":"6.3"},-10,{"v":-83.33333333333334,"d":"-83"},27,-64,15,{"v":45.45454545454545,"d":"45"},18,"MP4B006",{"v":0.3694581280788177,"d":"0.369"},"MP1B006",{"v":10.778443113772456,"d":"10.778"}]
["B006",{"v":10.714285714285714,"d":"10.7"},"B006",75,19,{"v":57.57575757575758,"d":"58"},19,{"$f":"(19/28)*100","v":{"v":67.85714285714286,"d":"68"}},null,null,"B006",{"v":6.875,"d":"6.9"},-11,{"v":-91.66666666666666,"d":"-92"},26,-73,14,{"v":42.42424242424242,"d":"42"},19,"MP4B009",{"v":0.3899835796387521,"d":"0.390"},"MP1B009",{"v":11.377245508982035,"d":"11.377"}]
["B009",{"v":11.30952380952381,"d":"11.3"},"B009",{"v":79.16666666666666,"d":"79"},20,{"v":60.60606060606061,"d":"61"},20,{"$f":"(20/28)*100","v":{"v":71.42857142857143,"d":"71"}},null,null,"B009",7.5,-12,-100,22,-82,13,{"v":39.39393939393939,"d":"39"},20,"MP4B012",{"v":0.41050903119868637,"d":"0.411"},"MP1B012",{"v":11.976047904191617,"d":"11.976"}]
["B012",{"v":11.904761904761903,"d":"11.9"},"B012",{"v":83.33333333333334,"d":"83"},21,{"v":63.63636363636363,"d":"64"},21,{"$f":"(21/28)*100","v":75},null,null,"B012",{"v":8.125,"d":"8.1"},null,null,23,-91,12,{"v":36.36363636363637,"d":"36"},21,"MP4B024",{"v":0.43103448275862066,"d":"0.431"},"MP1B024",{"v":12.574850299401197,"d":"12.575"}]
["B024",12.5,"B024",{"v":87.5,"d":"88"},22,{"v":66.66666666666666,"d":"67"},22,{"$f":"(22/28)*100","v":{"v":78.57142857142857,"d":"79"}},null,null,"B024",{"v":8.75,"d":"8.8"},null,null,24,-100,11,{"v":33.33333333333333,"d":"33"},22,"MP4B036",{"v":0.45155993431855496,"d":"0.452"},"MP1B036",{"v":13.17365269461078,"d":"13.174"}]
["B036",{"v":13.095238095238097,"d":"13.1"},"B036",{"v":91.66666666666666,"d":"92"},23,{"v":69.6969696969697,"d":"70"},23,{"$f":"(23/28)*100","v":{"v":82.14285714285714,"d":"82"}},null,null,"B036",{"v":9.375,"d":"9.4"},null,null,25,0,10,{"v":30.303030303030305,"d":"30"},23,"MP4B048",{"v":0.47208538587848936,"d":"0.472"},"MP1B048",{"v":13.77245508982036,"d":"13.772"}]
["B048",{"v":13.690476190476192,"d":"13.7"},"B048",{"v":95.83333333333334,"d":"96"},24,{"v":72.72727272727273,"d":"73"},24,{"$f":"(24/28)*100","v":{"v":85.71428571428571,"d":"86"}},null,null,"B048",{"v":10,"d":"10.0"},{"$nulls":4},9,{"v":27.27272727272727,"d":"27"},24,"MP4B096",{"$f":"(S24/4872)*100","v":{"v":0.47208538587848936,"d":"0.472"}},"MP1B096",{"v":14.37125748502994,"d":"14.371"}]
["B096",{"v":14.285714285714285,"d":"14.3"},"B096",100,25,{"v":75.75757575757575,"d":"76"},25,{"$f":"(25/28)*100","v":{"v":89.28571428571429,"d":"89"}},null,null,"B096",{"v":10.625,"d":"10.6"},{"$nulls":4},8,{"v":24.242424242424242,"d":"24"},25,"MP4B144",{"$f":"(S26/4872)*100","v":{"v":0.513136288998358,"d":"0.513"}},"MP1B144",{"v":14.97005988023952,"d":"14.970"}]
["B144",{"v":14.880952380952381,"d":"14.9"},null,null,26,{"v":78.78787878787878,"d":"79"},26,{"$f":"(26/28)*100","v":{"v":92.85714285714286,"d":"93"}},null,null,"B144",{"v":11.25,"d":"11.3"},{"$nulls":4},7,{"v":21.21212121212121,"d":"21"},26,"MP4B192",{"v":0.5336617405582923,"d":"0.534"},"MP1B192",{"v":15.568862275449103,"d":"15.569"}]
["B192",{"v":15.476190476190476,"d":"15.5"},null,null,27,{"v":81.81818181818183,"d":"82"},27,{"$f":"(27/28)*100","v":{"v":96.42857142857143,"d":"96"}},null,null,"B192",{"v":11.875,"d":"11.9"},{"$nulls":4},6,{"v":18.181818181818183,"d":"18"},27,"MP4B384",{"v":0.5541871921182266,"d":"0.554"},"MP1B384",{"v":16.16766467065868,"d":"16.168"}]
["B384",{"v":16.071428571428573,"d":"16.1"},null,null,28,{"v":84.84848484848484,"d":"85"},28,{"$f":"(28/28)*100","v":100},null,null,"B384",12.5,{"$nulls":4},5,{"v":15.151515151515152,"d":"15"},28,"MP4C0",{"v":0.5747126436781609,"d":"0.575"},"MP1C0",{"v":16.766467065868262,"d":"16.766"}]
["C0",{"v":16.666666666666664,"d":"16.7"},null,null,29,{"v":87.87878787878788,"d":"88"},{"$nulls":4},"C0",{"v":13.125,"d":"13.1"},{"$nulls":4},4,{"v":12.121212121212121,"d":"12"},29,"MP4C001",{"v":0.5952380952380952,"d":"0.595"},"MP1C001",{"v":17.365269461077844,"d":"17.365"}]
["C001",{"v":17.261904761904763,"d":"17.3"},null,null,30,{"v":90.9090909090909,"d":"91"},{"$nulls":4},"C001",{"v":13.75,"d":"13.8"},{"$nulls":4},3,{"v":9.090909090909092,"d":"9"},30,"MP4C002",{"v":0.6157635467980296,"d":"0.616"},"MP1C002",{"v":17.964071856287426,"d":"17.964"}]
["C002",{"v":17.857142857142858,"d":"17.9"},null,null,31,{"v":93.93939393939394,"d":"94"},{"$nulls":4},"C002",{"v":14.375,"d":"14.4"},{"$nulls":4},2,{"v":6.0606060606060606,"d":"6"},31,"MP4C003",{"v":0.6362889983579639,"d":"0.636"},"MP1C003",{"v":18.562874251497004,"d":"18.563"}]
["C003",{"v":18.452380952380953,"d":"18.5"},null,null,32,{"v":96.96969696969697,"d":"97"},{"$nulls":4},"C003",{"v":15,"d":"15.0"},{"$nulls":4},1,{"v":3.0303030303030303,"d":"3"},32,"MP4C004",{"v":0.6568144499178982,"d":"0.657"},"MP1C004",{"v":19.16167664670659,"d":"19.162"}]
["C006",{"v":19.047619047619047,"d":"19.0"},null,null,33,100,{"$nulls":4},"C006",{"v":15.625,"d":"15.6"},{"$nulls":4},0,0,33,"MP4C009",{"v":0.6773399014778325,"d":"0.677"},"MP1C009",{"v":19.760479041916167,"d":"19.760"}]
["C009",{"v":19.642857142857142,"d":"19.6"},null,null,34,{"$nulls":5},"C009",{"v":16.25,"d":"16.3"},{"$nulls":4},-1,{"v":-3.571428571428571,"d":"-4"},34,"MP4C012",{"v":0.6978653530377669,"d":"0.698"},"MP1C012",{"v":20.35928143712575,"d":"20.359"}]
["C012",{"v":20.238095238095237,"d":"20.2"},null,null,35,{"$nulls":5},"C012",{"v":16.875,"d":"16.9"},{"$nulls":4},-2,{"v":-7.142857142857142,"d":"-7"},35,"MP4C024",{"v":0.7183908045977011,"d":"0.718"},"MP1C024",{"v":20.958083832335326,"d":"20.958"}]
["C024",{"v":20.833333333333336,"d":"20.8"},null,null,36,{"$nulls":5},"C024",17.5,{"$nulls":4},-3,{"v":-10.714285714285714,"d":"-11"},36,"MP4C034",{"v":0.7389162561576355,"d":"0.739"},"MP1C034",{"v":21.55688622754491,"d":"21.557"}]
["C036",{"v":21.428571428571427,"d":"21.4"},null,null,37,{"$nulls":5},"C036",{"v":18.125,"d":"18.1"},{"$nulls":4},-4,{"v":-14.285714285714285,"d":"-14"},37,"MP4C048",{"v":0.7594417077175698,"d":"0.759"},"MP1C048",{"v":22.15568862275449,"d":"22.156"}]
["C048",{"v":22.023809523809522,"d":"22.0"},null,null,38,{"$nulls":5},"C048",{"v":18.75,"d":"18.8"},{"$nulls":4},-5,{"v":-17.857142857142858,"d":"-18"},38,"MP4C094",{"v":0.7799671592775042,"d":"0.780"},"MP1C094",{"v":22.75449101796407,"d":"22.754"}]
["C096",{"v":22.61904761904762,"d":"22.6"},null,null,39,{"$nulls":5},"C096",{"v":19.375,"d":"19.4"},{"$nulls":4},-6,{"v":-21.428571428571427,"d":"-21"},39,"MP4C144",{"v":0.8004926108374385,"d":"0.800"},"MP1C144",{"v":23.353293413173652,"d":"23.353"}]
{"$rows_left_out":4832}